Target
C-X-C chemokine receptor type 3
Ligand
BDBM389773
Substrate
Meas. Tech.
FLIPR Assay
IC50
0.970±n/a nM
Citation
 Caroff, ECastro, RMeyer, EKimmerlin, T 8-(piperazin-1-yl)-1,2,3,4-tetrahydro-isoquinoline derivatives US Patent  US9951063 Publication Date 4/24/2018 
Target
Name:
C-X-C chemokine receptor type 3
Synonyms:
AAO92295.1 C-X-C chemokine receptor type 3 (CXCR3) CXCR3 CXCR3_HUMAN chemokine (C-X-C motif) receptor 3
Type:
Enzyme Catalytic Domain
Mol. Mass.:
40665.65
Organism:
Homo sapiens (Human)
Description:
Residue:
368
  
Inhibitor
Name:
BDBM389773
Synonyms:
US9951063, 92
Type:
Small organic molecule
Emp. Form.:
C28H31N7O
Mol. Mass.:
481.592
SMILES:
C[C@@H]1CN(CCN1C(=O)Cn1cnc2cccnc12)c1cccc2CCN(Cc12)c1ccc(C)nc1
: