Target
C-X-C chemokine receptor type 3
Ligand
BDBM389791
Substrate
Meas. Tech.
FLIPR Assay
IC50
0.850±n/a nM
Citation
 Caroff, ECastro, RMeyer, EKimmerlin, T 8-(piperazin-1-yl)-1,2,3,4-tetrahydro-isoquinoline derivatives US Patent  US9951063 Publication Date 4/24/2018 
Target
Name:
C-X-C chemokine receptor type 3
Synonyms:
AAO92295.1 C-X-C chemokine receptor type 3 (CXCR3) CXCR3 CXCR3_HUMAN chemokine (C-X-C motif) receptor 3
Type:
Enzyme Catalytic Domain
Mol. Mass.:
40665.65
Organism:
Homo sapiens (Human)
Description:
Residue:
368
  
Inhibitor
Name:
BDBM389791
Synonyms:
2-Imidazo[4,5-b]pyridin-3-yl-1-{(R)-2-methyl-4-[2-(2-propyl-pyrimidin-5-yl)-1,2,3,4-tetrahydro-isoquinolin-8-yl]-piperazin-1-yl}-ethanone | US9951063, 110
Type:
Small organic molecule
Emp. Form.:
C29H34N8O
Mol. Mass.:
510.6333
SMILES:
CCCc1ncc(cn1)N1CCc2cccc(N3CCN([C@H](C)C3)C(=O)Cn3cnc4cccnc34)c2C1
: