Target
Calcium-dependent protein kinase 1
Ligand
BDBM50446181
Substrate
Meas. Tech.
Inhibition Assay
IC50
4.00±n/a nM
Citation
 Fan, EVan Voorhis, WCZhang, ZHuang, WOjo, KK 5-aminopyrazole-4-carboxamide inhibitors of CDPK1 from T. gondii and C. parvum US Patent  US9956214 Publication Date 5/1/2018 
Target
Name:
Calcium-dependent protein kinase 1
Synonyms:
Calcium-dependent protein kinase 1 (CDPK1)
Type:
Protein
Mol. Mass.:
76617.33
Organism:
Cryptosporidium parvum
Description:
Q6S4W0
Residue:
677
  
Inhibitor
Name:
BDBM50446181
Synonyms:
CHEMBL3108912 US9956214, Compound 1
Type:
Small organic molecule
Emp. Form.:
C18H20N4O
Mol. Mass.:
308.3776
SMILES:
CC(C)(C)n1nc(c(C(N)=O)c1N)-c1ccc2ccccc2c1
: