Target
Calcium-dependent protein kinase 1
Ligand
BDBM50383379
Substrate
Meas. Tech.
Inhibition Assay
IC50
1.000±n/a nM
Citation
 Fan, EVan Voorhis, WCZhang, ZHuang, WOjo, KK 5-aminopyrazole-4-carboxamide inhibitors of CDPK1 from T. gondii and C. parvum US Patent  US9956214 Publication Date 5/1/2018 
Target
Name:
Calcium-dependent protein kinase 1
Synonyms:
Calcium-dependent protein kinase 1 (CDPK1)
Type:
Protein
Mol. Mass.:
76617.33
Organism:
Cryptosporidium parvum
Description:
Q6S4W0
Residue:
677
  
Inhibitor
Name:
BDBM50383379
Synonyms:
CHEMBL2030552 US9518026, Example 7 | US9956214, Compound 7
Type:
Small organic molecule
Emp. Form.:
C21H22N6
Mol. Mass.:
358.4396
SMILES:
Nc1ncnc2n(CC3CCNCC3)nc(-c3ccc4ccccc4c3)c12
: