Target
Calcium-dependent protein kinase 1
Ligand
BDBM50148652
Substrate
Meas. Tech.
Inhibition Assay
IC50
2.00±n/a nM
Citation
 Fan, EVan Voorhis, WCZhang, ZHuang, WOjo, KK 5-aminopyrazole-4-carboxamide inhibitors of CDPK1 from T. gondii and C. parvum US Patent  US9956214 Publication Date 5/1/2018 
Target
Name:
Calcium-dependent protein kinase 1
Synonyms:
Calcium-dependent protein kinase 1 (CDPK1)
Type:
Protein
Mol. Mass.:
76617.33
Organism:
Cryptosporidium parvum
Description:
Q6S4W0
Residue:
677
  
Inhibitor
Name:
BDBM50148652
Synonyms:
CHEMBL3770802 US9956214, Compound 1633
Type:
Small organic molecule
Emp. Form.:
C21H25N5O2
Mol. Mass.:
379.4555
SMILES:
CCOc1ccc2cc(ccc2n1)-c1nn(C2CCCCC2)c(N)c1C(N)=O
: