Target
Calcium-dependent protein kinase 1
Ligand
BDBM286287
Substrate
Meas. Tech.
Inhibition Assay
IC50
5.00±n/a nM
Citation
 Fan, EVan Voorhis, WCZhang, ZHuang, WOjo, KK 5-aminopyrazole-4-carboxamide inhibitors of CDPK1 from T. gondii and C. parvum US Patent  US9956214 Publication Date 5/1/2018 
Target
Name:
Calcium-dependent protein kinase 1
Synonyms:
Calcium-dependent protein kinase 1 (CDPK1)
Type:
Protein
Mol. Mass.:
76617.33
Organism:
Cryptosporidium parvum
Description:
Q6S4W0
Residue:
677
  
Inhibitor
Name:
BDBM286287
Synonyms:
US9518026, Example 80 | US9956214, Compound 1644
Type:
Small organic molecule
Emp. Form.:
C22H27N5O3
Mol. Mass.:
409.4815
SMILES:
CC(C)(CO)Cn1nc(c(C(N)=O)c1N)-c1cnc2cc(OC3CCC3)ccc2c1
: