Target
Poly [ADP-ribose] polymerase 1
Ligand
BDBM27692
Substrate
BDBM27683
Meas. Tech.
PARP-1 Enzyme Inhibition Assay
pH
8±n/a
Temperature
296.15±n/a K
IC50
1841.5±n/a nM
Citation
 Moree, WJGoldman, PDemaggio, AJChristenson, EHerendeen, DEksterowicz, JKesicki, EAMcElligott, DLBeaton, G Identification of ring-fused pyrazolo pyridin-2-ones as novel poly(ADP-ribose)polymerase-1 inhibitors. Bioorg Med Chem Lett 18:5126-9 (2008)  
Target
Name:
Poly [ADP-ribose] polymerase 1
Synonyms:
(ARTD1 or PARP1) 2.4.2.30 ADPRT ARTD1 Human diphtheria toxin-like ADP-ribosyltransferase (ARTD1 or PARP1) NT-PARP-1 PARP1 PPOL Poly [ADP-ribose] polymerase 1 (PARP) Poly [ADP-ribose] polymerase 1 (PARP1) Poly [ADP-ribose] polymerase 1, 28-kDa form Poly [ADP-ribose] polymerase 1, processed C-terminus Poly [ADP-ribose] polymerase-1 Poly(ADP-ribose) polymerase-1 (ARTD1/PARP1) Protein poly-ADP-ribosyltransferase PARP1 | Synonyms=ADPRT
Type:
Mol. Mass.:
113114.22
Organism:
Homo sapiens (Human)
Description:
P09874
Residue:
1014
  
Inhibitor
Name:
BDBM27692
Synonyms:
5-tert-butyl-3-methyl-11-thia-4,5,7-triazatricyclo[7.3.0.0^{2,6}]dodeca-1(9),2(6),3-trien-8-one | ring-fused pyrazolo pyridin-2-one, 19
Type:
Small organic molecule
Emp. Form.:
C13H17N3OS
Mol. Mass.:
263.359
SMILES:
Cc1nn(c2[nH]c(=O)c3CSCc3c12)C(C)(C)C
:
Substrate
Name:
BDBM27683
Synonyms:
[adenylate-32P]-NAD
Type:
radiolabeled substrate
Emp. Form.:
Mol. Mass.:
SMILES:
: