Target
Insulin-like growth factor 1 receptor
Ligand
BDBM27803
Substrate
Biotinylated substrate peptide
Meas. Tech.
IGF-1R Inhibition Assay
pH
7.5±n/a
Temperature
295.15±n/a K
IC50
1±n/a nM
Citation
 Chamberlain, SDRedman, AMWilson, JWDeanda, FShotwell, JBGerding, RLei, HYang, BStevens, KLHassell, AMShewchuk, LMLeesnitzer, MASmith, JLSabbatini, PAtkins, CGroy, ARowand, JLKumar, RMook, RAMoorthy, GPatnaik, S Optimization of 4,6-bis-anilino-1H-pyrrolo[2,3-d]pyrimidine IGF-1R tyrosine kinase inhibitors towards JNK selectivity. Bioorg Med Chem Lett 19:360-4 (2009)  
Target
Name:
Insulin-like growth factor 1 receptor
Synonyms:
CD_antigen=CD221 IGF1R Insulin-like growth factor 1 receptor (IGF1R) Insulin-like growth factor 1 receptor alpha chain Insulin-like growth factor I receptor | Insulin-like growth factor receptor (IGFR)
Type:
Protein
Mol. Mass.:
154776.79
Organism:
Homo sapiens (Human)
Description:
P08069
Residue:
1367
  
Inhibitor
Name:
BDBM27803
Synonyms:
2-fluoro-6-{[2-({5-methoxy-1-[2-(pyrrolidin-1-yl)acetyl]-2,3-dihydro-1H-indol-6-yl}amino)-7H-pyrrolo[2,3-d]pyrimidin-4-yl]amino}benzamide | pyrrolo[2,3-d]pyrimidine deriv., 27
Type:
Small organic molecule
Emp. Form.:
C28H29FN8O3
Mol. Mass.:
544.5801
SMILES:
COc1cc2CCN(C(=O)CN3CCCC3)c2cc1Nc1nc(Nc2cccc(F)c2C(N)=O)c2cc[nH]c2n1
:
Substrate
Name:
Biotinylated substrate peptide
Synonyms:
Type:
Peptide
Mol. Mass.:
3542.16
Organism:
Description:
Residue:
29