Target
Orotidine 5'-phosphate decarboxylase
Ligand
BDBM27946
Substrate
BDBM21336
Meas. Tech.
Enzyme Inhibition Assay
pH
7.5±n/a
Temperature
328.15±n/a K
Ki
29000±300 nM
Citation
 Bello, AMKonforte, DPoduch, EFurlonger, CWei, LLiu, YLewis, MPai, EFPaige, CJKotra, LP Structure-activity relationships of orotidine-5'-monophosphate decarboxylase inhibitors as anticancer agents. J Med Chem 52:1648-58 (2009)  
Target
Name:
Orotidine 5'-phosphate decarboxylase
Synonyms:
OMP decarboxylase Orotidine 5-phosphate decarboxylase PYRF_METTH | pyrF
Type:
Enzyme
Mol. Mass.:
24909.45
Organism:
Methanobacterium thermoautotrophicum
Description:
Residue:
228
  
Inhibitor
Name:
BDBM27946
Synonyms:
uridine derivative, 43 | {[(2R,3S,4R,5R)-5-(6-ethyl-5-fluoro-2,4-dioxo-1,2,3,4-tetrahydropyrimidin-1-yl)-3,4-dihydroxyoxolan-2-yl]methoxy}phosphonic acid
Type:
Emp. Form.:
C11H16FN2O9P
Mol. Mass.:
370.2249
SMILES:
CCc1c(F)c(=O)[nH]c(=O)n1[C@@H]1O[C@H](COP(O)(O)=O)[C@@H](O)[C@H]1O
:
Substrate
Name:
BDBM21336
Synonyms:
3-[(2R,3R,4S,5R)-3,4-dihydroxy-5-[(phosphonooxy)methyl]oxolan-2-yl]-2,6-dioxo-1,2,3,6-tetrahydropyrimidine-4-carboxylic acid orotidine 5-monophosphate | orotidylic acid
Type:
Nucleoside or nucleotide
Emp. Form.:
C10H13N2O11P
Mol. Mass.:
368.1908
SMILES:
O[C@@H]1[C@@H](COP(O)(O)=O)O[C@H]([C@@H]1O)n1c(cc(=O)[nH]c1=O)C(O)=O
: