Target
Baculoviral IAP repeat-containing protein 7
Ligand
BDBM391804
Substrate
Meas. Tech.
Biological Assays
Ki
<25000±n/a nM
Citation
 Pache, LChanda, SKVamos, MDCosford, NDTeriete, PMarlett, JDiaz, AYoung, JA Use of inhibitor of apoptosis protein (IAP) antagonists in HIV therapy US Patent  US10300074 Publication Date 5/28/2019 
Target
Name:
Baculoviral IAP repeat-containing protein 7
Synonyms:
BIR3 BIRC7_HUMAN KIAP MLIAP | RNF50
Type:
PROTEIN
Mol. Mass.:
32792.04
Organism:
Homo sapiens (Human)
Description:
ChEMBL_624591
Residue:
298
  
Inhibitor
Name:
BDBM391804
Synonyms:
US10300074, Product 17a | US11111270, Compound 27
Type:
Small organic molecule
Emp. Form.:
C27H32N4O4
Mol. Mass.:
476.5674
SMILES:
CN[C@@H](C)C(=O)N[C@H]1CCO[C@@H]2N(C(C(=O)N[C@@H]3CCCc4ccccc34)c3ccccc23)C1=O
: