Target
Dimer of Gag-Pol polyprotein [489-587]
Ligand
BDBM335
Substrate
Fluorogenic Peptide Substrate
Meas. Tech.
Protease Inhibition Assay
pH
5±n/a
Temperature
303.15±n/a K
Ki
11±n/a nM
Citation
 Schaal, WKarlsson, AAhlsen, GLindberg, JAndersson, HODanielson, UHClasson, BUnge, TSamuelsson, BHulten, JHallberg, AKarlen, A Synthesis and comparative molecular field analysis (CoMFA) of symmetric and nonsymmetric cyclic sulfamide HIV-1 protease inhibitors. J Med Chem 44:155-69 (2001)  
Target
Name:
Dimer of Gag-Pol polyprotein [489-587]
Synonyms:
HIV-1 Protease
Type:
Protein Complex
Mol. Mass.:
Description:
Components:
This complex has 2 components.
Component 1
Name:
Gag-Pol polyprotein [489-587]
Synonyms:
HIV protease HIV-1 Protease chain A POL_HV1N5 | gag-pol
Type:
Enzyme Subunit
Mol. Mass.:
10822.21
Organism:
Human immunodeficiency virus type 1
Description:
P12497[489-587]
Residue:
99
  
Component 2
Name:
Gag-Pol polyprotein [489-587]
Synonyms:
HIV protease HIV-1 Protease chain A POL_HV1N5 | gag-pol
Type:
Enzyme Subunit
Mol. Mass.:
10822.21
Organism:
Human immunodeficiency virus type 1
Description:
P12497[489-587]
Residue:
99
  
Inhibitor
Name:
BDBM335
Synonyms:
(3R,4S,5S,6R)-3,6-Bis(phenoxymethyl)-4,5-dihydroxy-2-[3-(N-methylcarbamoyl)benzyl]-7-benzyl-1,2,7-thiadiazepine 1,1-Dioxide CHEMBL357057 | Cyclic Sulfamide deriv. 13
Type:
Small organic molecule
Emp. Form.:
C34H37N3O7S
Mol. Mass.:
631.738
SMILES:
CNC(=O)c1cccc(CN2[C@H](COc3ccccc3)[C@H](O)[C@@H](O)[C@@H](COc3ccccc3)N(Cc3ccccc3)S2(=O)=O)c1
:
Substrate
Name:
Fluorogenic Peptide Substrate
Synonyms:
Type:
Peptide
Mol. Mass.:
4156.59
Organism:
Description:
Residue:
39