Target
Stromelysin-2
Ligand
BDBM29018
Substrate
Fluorescence-quenched peptide substrate
Meas. Tech.
Inhibition Potency Measurements
pH
7±n/a
Temperature
298.15±n/a K
IC50
865000±n/a nM
Citation
 Mannino, CNievo, MMachetti, FPapakyriakou, ACalderone, VFragai, MGuarna, A Synthesis of bicyclic molecular scaffolds (BTAa): an investigation towards new selective MMP-12 inhibitors. Bioorg Med Chem 14:7392-403 (2006)  
Target
Name:
Stromelysin-2
Synonyms:
MMP10 Matrix Metalloproteinase-10 (MMP-10) STMY2
Type:
Enzyme
Mol. Mass.:
54143.02
Organism:
Homo sapiens (Human)
Description:
P09238
Residue:
476
  
Inhibitor
Name:
BDBM29018
Synonyms:
(1S,5S,7R)-3-N-hydroxy-7-N-[(4-phenylphenyl)methyl]-6,8-dioxa-3-azabicyclo[3.2.1]octane-3,7-dicarboxamide | 3-azadioxabicyclooctane derivative, 20
Type:
Small organic molecule
Emp. Form.:
C20H21N3O5
Mol. Mass.:
383.3978
SMILES:
ONC(=O)N1C[C@H]2O[C@@H](C1)[C@@H](O2)C(=O)NCc1ccc(cc1)-c1ccccc1
:
Substrate
Name:
Fluorescence-quenched peptide substrate
Synonyms:
Type:
Peptide
Mol. Mass.:
2468.31
Organism:
Description:
Residue:
23