Target
Amine oxidase [flavin-containing] A
Ligand
BDBM15581
Substrate
BDBM29135
Meas. Tech.
MAO Enzyme Inhibition Assay
pH
7.4±n/a
Temperature
310.15±n/a K
IC50
4.5±0.32 nM
Citation
 Chimenti, FFioravanti, RBolasco, AChimenti, PSecci, DRossi, FYáñez, MOrallo, FOrtuso, FAlcaro, S Chalcones: a valid scaffold for monoamine oxidases inhibitors. J Med Chem 52:2818-24 (2009)  
Target
Name:
Amine oxidase [flavin-containing] A
Synonyms:
AOFA_HUMAN MAO-A Monoamine oxidase Monoamine oxidase type A (MAO A) Monoamine oxidase type A (MAOA)
Type:
Protein
Mol. Mass.:
59689.53
Organism:
Homo sapiens (Human)
Description:
P21397
Residue:
527
  
Inhibitor
Name:
BDBM15581
Synonyms:
CHEMBL8706 CLORGILINE N-[3-(2,4-dichlorophenoxy)propyl]-N-methyl-prop-2-yn-1-amine US9603833, Clorgyline | [3-(2,4-dichlorophenoxy)propyl](methyl)prop-2-yn-1-ylamine
Type:
Small organic molecule
Emp. Form.:
C13H15Cl2NO
Mol. Mass.:
272.17
SMILES:
CN(CCCOc1ccc(Cl)cc1Cl)CC#C
:
Substrate
Name:
BDBM29135
Synonyms:
CHEMBL11608 p-Tyramine | tyramine
Type:
Small organic molecule
Emp. Form.:
C8H11NO
Mol. Mass.:
137.179
SMILES:
NCCc1ccc(O)cc1
: