Target
Nitric oxide synthase, brain [D597N,M336V]
Ligand
BDBM29232
Substrate
BDBM21959
Meas. Tech.
NOS Enzyme Inhibition Assay
pH
7.5±n/a
Temperature
303.15±n/a K
Ki
49200±n/a nM
Citation
 Igarashi, JLi, HJamal, JJi, HFang, JLawton, GRSilverman, RBPoulos, TL Crystal structures of constitutive nitric oxide synthases in complex with de novo designed inhibitors. J Med Chem 52:2060-6 (2009)  
Target
Name:
Nitric oxide synthase, brain [D597N,M336V]
Synonyms:
Bnos Nitric Oxide Synthase, brain Mutant (D597N/M336V) nNOS D597N/M336V double mutant
Type:
Enzyme
Mol. Mass.:
160538.94
Organism:
Rattus norvegicus (rat)
Description:
Recombinant nNOS double mutant overexpressed in E. coli was used in enzyme assays.
Residue:
1429
  
Inhibitor
Name:
BDBM29232
Synonyms:
3-({(3S,4S)-4-[(6-aminopyridin-2-yl)methyl]pyrrolidin-3-yl}amino)propan-1-ol | aminopyridine-pyrrolidine, 4
Type:
Small organic molecule
Emp. Form.:
C13H22N4O
Mol. Mass.:
250.34
SMILES:
Nc1cccc(C[C@H]2CNC[C@H]2NCCCO)n1
:
Substrate
Name:
BDBM21959
Synonyms:
(2S)-2-amino-5-carbamimidamidopentanoic acid CHEMBL1485 | L-arginine
Type:
Amino Acid
Emp. Form.:
C6H14N4O2
Mol. Mass.:
174.201
SMILES:
[#7]-[#6@@H](-[#6]-[#6]-[#6]\[#7]=[#6](/[#7])-[#7])-[#6](-[#8])=O
: