Target
Nitric oxide synthase, brain [D597N,M336V]
Ligand
BDBM29234
Substrate
BDBM21959
Meas. Tech.
NOS Enzyme Inhibition Assay
pH
7.5±n/a
Temperature
303.15±n/a K
Ki
1200±n/a nM
Citation
 Igarashi, JLi, HJamal, JJi, HFang, JLawton, GRSilverman, RBPoulos, TL Crystal structures of constitutive nitric oxide synthases in complex with de novo designed inhibitors. J Med Chem 52:2060-6 (2009)  
Target
Name:
Nitric oxide synthase, brain [D597N,M336V]
Synonyms:
Bnos Nitric Oxide Synthase, brain Mutant (D597N/M336V) nNOS D597N/M336V double mutant
Type:
Enzyme
Mol. Mass.:
160538.94
Organism:
Rattus norvegicus (rat)
Description:
Recombinant nNOS double mutant overexpressed in E. coli was used in enzyme assays.
Residue:
1429
  
Inhibitor
Name:
BDBM29234
Synonyms:
CHEMBL481815 aminopyridine-pyrrolidine, 6
Type:
Small organic molecule
Emp. Form.:
C20H28ClN5
Mol. Mass.:
373.923
SMILES:
Cc1cc(N)nc(C[C@H]2CNC[C@H]2NCCNCc2ccc(Cl)cc2)c1
:
Substrate
Name:
BDBM21959
Synonyms:
(2S)-2-amino-5-carbamimidamidopentanoic acid CHEMBL1485 | L-arginine
Type:
Amino Acid
Emp. Form.:
C6H14N4O2
Mol. Mass.:
174.201
SMILES:
[#7]-[#6@@H](-[#6]-[#6]-[#6]\[#7]=[#6](/[#7])-[#7])-[#6](-[#8])=O
: