Target
Dimer of Gag-Pol polyprotein [489-587]
Ligand
BDBM513
Substrate
HIV-1 proteinase peptide substrate
Meas. Tech.
Protease Inhibition Assay
pH
6.5±n/a
Temperature
310.15±n/a K
IC50
35000±n/a nM
Comments
ID50
Citation
 Wang, SMilne, GWYan, XPosey, IJNicklaus, MCGraham, LRice, WG Discovery of novel, non-peptide HIV-1 protease inhibitors by pharmacophore searching. J Med Chem 39:2047-54 (1996)  
Target
Name:
Dimer of Gag-Pol polyprotein [489-587]
Synonyms:
HIV-1 Protease
Type:
Protein Complex
Mol. Mass.:
Description:
Components:
This complex has 2 components.
Component 1
Name:
Gag-Pol polyprotein [489-587]
Synonyms:
HIV protease HIV-1 Protease chain A POL_HV1N5 | gag-pol
Type:
Enzyme Subunit
Mol. Mass.:
10822.21
Organism:
Human immunodeficiency virus type 1
Description:
P12497[489-587]
Residue:
99
  
Component 2
Name:
Gag-Pol polyprotein [489-587]
Synonyms:
HIV protease HIV-1 Protease chain A POL_HV1N5 | gag-pol
Type:
Enzyme Subunit
Mol. Mass.:
10822.21
Organism:
Human immunodeficiency virus type 1
Description:
P12497[489-587]
Residue:
99
  
Inhibitor
Name:
BDBM513
Synonyms:
(2S,3R,4R,4aS,6aR,6bR,8aS,12aS,14aS,14bR)-2,3-dihydroxy-4,6a,6b,11,11,14b-hexamethyl-1,2,3,4,4a,5,6,6a,6b,7,8,8a,9,10,11,12,12a,14,14a,14b-icosahydropicene-4,8a-dicarboxylic acid NSC 382025
Type:
Small organic molecule
Emp. Form.:
C30H46O6
Mol. Mass.:
502.6826
SMILES:
[H][C@@]12CC(C)(C)CC[C@@]1(CC[C@@]1(C)C2=CC[C@@]2([H])[C@@]3(C)C[C@H](O)[C@H](O)[C@](C)(C(O)=O)[C@@]3([H])CC[C@@]12C)C(O)=O
:
Substrate
Name:
HIV-1 proteinase peptide substrate
Synonyms:
Type:
Peptide
Mol. Mass.:
3079.95
Organism:
Description:
Residue:
28