Target
Dimer of Gag-Pol polyprotein [489-587]
Ligand
BDBM515
Substrate
HIV-1 proteinase peptide substrate
Meas. Tech.
Protease Inhibition Assay
pH
6.5±n/a
Temperature
310.15±n/a K
IC50
42000±n/a nM
Comments
ID50
Citation
 Wang, SMilne, GWYan, XPosey, IJNicklaus, MCGraham, LRice, WG Discovery of novel, non-peptide HIV-1 protease inhibitors by pharmacophore searching. J Med Chem 39:2047-54 (1996)  
Target
Name:
Dimer of Gag-Pol polyprotein [489-587]
Synonyms:
HIV-1 Protease
Type:
Protein Complex
Mol. Mass.:
Description:
Components:
This complex has 2 components.
Component 1
Name:
Gag-Pol polyprotein [489-587]
Synonyms:
HIV protease HIV-1 Protease chain A POL_HV1N5 | gag-pol
Type:
Enzyme Subunit
Mol. Mass.:
10822.21
Organism:
Human immunodeficiency virus type 1
Description:
P12497[489-587]
Residue:
99
  
Component 2
Name:
Gag-Pol polyprotein [489-587]
Synonyms:
HIV protease HIV-1 Protease chain A POL_HV1N5 | gag-pol
Type:
Enzyme Subunit
Mol. Mass.:
10822.21
Organism:
Human immunodeficiency virus type 1
Description:
P12497[489-587]
Residue:
99
  
Inhibitor
Name:
BDBM515
Synonyms:
4-hydroxy-3-phenyl-2H-chromen-2-one NSC 251152
Type:
Small organic molecule
Emp. Form.:
C15H10O3
Mol. Mass.:
238.2381
SMILES:
Oc1c(-c2ccccc2)c(=O)oc2ccccc12
:
Substrate
Name:
HIV-1 proteinase peptide substrate
Synonyms:
Type:
Peptide
Mol. Mass.:
3079.95
Organism:
Description:
Residue:
28