Target
Prothrombin
Ligand
BDBM29373
Substrate
BDBM13573
Meas. Tech.
Surface Plasmon Resonance (SPR)-Based Biosensor Measurements (KD) and Enzyme Inhibition Assay (IC50)
pH
7.4±n/a
Temperature
310.15±n/a K
IC50
210000±n/a nM
Kd
45000±n/a nM
Citation
 Nilsson, MHämäläinen, MIvarsson, MGottfries, JXue, YHansson, SIsaksson, RFex, T Compounds binding to the S2-S3 pockets of thrombin. J Med Chem 52:2708-15 (2009)  
Target
Name:
Prothrombin
Synonyms:
Activation peptide fragment 1 Coagulation factor II Prothrombin precursor Thrombin heavy chain | Thrombin light chain
Type:
Protein
Mol. Mass.:
70029.57
Organism:
Homo sapiens (Human)
Description:
P00734
Residue:
622
  
Inhibitor
Name:
BDBM29373
Synonyms:
proline scaffold, 22
Type:
Small organic molecule
Emp. Form.:
C17H24ClN3O2
Mol. Mass.:
337.844
SMILES:
CCCNC(=O)[C@@H]1CCCN1C(=O)[C@H](N)Cc1ccc(Cl)cc1
:
Substrate
Name:
BDBM13573
Synonyms:
(2S)-5-carbamimidamido-N-(4-nitrophenyl)-2-{[(2S)-1-{[(2S)-5-oxopyrrolidin-2-yl]carbonyl}pyrrolidin-2-yl]formamido}pentanamide hydrochloride Glu-Pro-Arg-pNA L-Pyroglutamyl-L-prolyl-L-arginine-p-Nitroaniline S-2366
Type:
Small organic molecule
Emp. Form.:
C22H30N8O6
Mol. Mass.:
502.5236
SMILES:
[#7]\[#6](-[#7])=[#7]/[#6]-[#6]-[#6]-[#6@H](-[#7]-[#6](=O)-[#6@@H]-1-[#6]-[#6]-[#6]-[#7]-1-[#6](=O)-[#6@@H]-1-[#6]-[#6]-[#6](=O)-[#7]-1)-[#6](=O)-[#7]-c1ccc(cc1)-[#7+](-[#8-])=O
: