Target
5-hydroxytryptamine receptor 1A
Ligand
BDBM29554
Substrate
BDBM21393
Meas. Tech.
Radioligand Binding Assay (Ki)
pH
7.4±n/a
Temperature
310.15±n/a K
Ki
454±n/a nM
Citation
 Badarau, ESuzenet, FBojarski, AJFînaru, ALGuillaumet, G Benzimidazolone-based serotonin 5-HT1A or 5-HT7R ligands: synthesis and biological evaluation. Bioorg Med Chem Lett 19:1600-3 (2009)  
Target
Name:
5-hydroxytryptamine receptor 1A
Synonyms:
5-HT-1A 5-HT1A 5-hydroxytryptamine receptor 1A (5HT1A) 5ht1a Htr1a Serotonin 1a (5-HT1a) receptor/Adrenergic receptor alpha-1 | Serotonin receptor 1A
Type:
G Protein-Coupled Receptor (GPCR)
Mol. Mass.:
46445.29
Organism:
Rattus norvegicus (rat)
Description:
Binding assays were performed using rat hippocampal membranes.
Residue:
422
  
Inhibitor
Name:
BDBM29554
Synonyms:
benzimidazolone scaffold, 15m
Type:
Small organic molecule
Emp. Form.:
C22H27ClN4O
Mol. Mass.:
398.929
SMILES:
Clc1ccc(cc1)N1CCN(CCCCCn2c3ccccc3[nH]c2=O)CC1
:
Substrate
Name:
BDBM21393
Synonyms:
7-(dipropylamino)-5,6,7,8-tetrahydronaphthalen-1-ol 8-OH-DPAT 8-OH-DPAT,(-) CHEMBL1788118 CHEMBL56 US10562853, Compound 8-OH-DPAT cid_1220
Type:
radiolabeled ligand
Emp. Form.:
C16H25NO
Mol. Mass.:
247.3758
SMILES:
CCCN(CCC)C1CCc2cccc(O)c2C1
: