Target
Caspase-3
Ligand
BDBM29570
Substrate
Caspase-3 Substrate
Meas. Tech.
Enzyme Inhibition Assay
IC50
1430±n/a nM
Citation
 Chu, WRothfuss, JChu, YZhou, DMach, RH Synthesis and in vitro evaluation of sulfonamide isatin Michael acceptors as small molecule inhibitors of caspase-6. J Med Chem 52:2188-91 (2009)  
Target
Name:
Caspase-3
Synonyms:
Apopain CASP3 CPP-32 Caspase 3 Caspase-3 subunit p17 SCA-1 Yama protein | caspase-3 preproprotein
Type:
Hydrolase; heterotetramer of two heterodimers
Mol. Mass.:
31607.55
Organism:
Homo sapiens (Human)
Description:
Residue:
277
  
Inhibitor
Name:
BDBM29570
Synonyms:
isatin sulfonamide, 9c
Type:
Small organic molecule
Emp. Form.:
C19H16Cl2N2O5S
Mol. Mass.:
455.312
SMILES:
Clc1ccc(CN2C(=O)C(=O)c3cc(ccc23)S(=O)(=O)N2CCOCC2)cc1Cl
:
Substrate
Name:
Caspase-3 Substrate
Synonyms:
N-Acetyl-Asp-Glu-Val-Asp-7-amido-4-methylcoumarin
Type:
Fluorogenic Substrate
Mol. Mass.:
953.05
Organism:
Description:
Residue:
9
ACDEVDAMC