Target
Caspase-3
Ligand
BDBM29582
Substrate
Caspase-3 Substrate
Meas. Tech.
Enzyme Inhibition Assay
IC50
323±n/a nM
Citation
 Chu, WRothfuss, JChu, YZhou, DMach, RH Synthesis and in vitro evaluation of sulfonamide isatin Michael acceptors as small molecule inhibitors of caspase-6. J Med Chem 52:2188-91 (2009)  
Target
Name:
Caspase-3
Synonyms:
Apopain CASP3 CPP-32 Caspase 3 Caspase-3 subunit p17 SCA-1 Yama protein | caspase-3 preproprotein
Type:
Hydrolase; heterotetramer of two heterodimers
Mol. Mass.:
31607.55
Organism:
Homo sapiens (Human)
Description:
Residue:
277
  
Inhibitor
Name:
BDBM29582
Synonyms:
isatin Michael acceptor (IMA) analogue, 18a
Type:
Small organic molecule
Emp. Form.:
C21H16N4O3S
Mol. Mass.:
404.442
SMILES:
O=[#6]1-[#7](-[#6]-c2ccccc2)-c2ccc(cc2\[#6]-1=[#6](/C#N)C#N)S(=O)(=O)[#7]-1-[#6]-[#6]-[#6]-1
:
Substrate
Name:
Caspase-3 Substrate
Synonyms:
N-Acetyl-Asp-Glu-Val-Asp-7-amido-4-methylcoumarin
Type:
Fluorogenic Substrate
Mol. Mass.:
953.05
Organism:
Description:
Residue:
9
ACDEVDAMC