Target
Caspase-3
Ligand
BDBM29587
Substrate
Caspase-3 Substrate
Meas. Tech.
Enzyme Inhibition Assay
IC50
724±n/a nM
Citation
 Chu, WRothfuss, JChu, YZhou, DMach, RH Synthesis and in vitro evaluation of sulfonamide isatin Michael acceptors as small molecule inhibitors of caspase-6. J Med Chem 52:2188-91 (2009)  
Target
Name:
Caspase-3
Synonyms:
Apopain CASP3 CPP-32 Caspase 3 Caspase-3 subunit p17 SCA-1 Yama protein | caspase-3 preproprotein
Type:
Hydrolase; heterotetramer of two heterodimers
Mol. Mass.:
31607.55
Organism:
Homo sapiens (Human)
Description:
Residue:
277
  
Inhibitor
Name:
BDBM29587
Synonyms:
isatin Michael acceptor (IMA) analogue, 19c
Type:
Small organic molecule
Emp. Form.:
C22H16Cl2N4O3S
Mol. Mass.:
487.358
SMILES:
Clc1ccc(-[#6]-[#7]-2-[#6](=O)\[#6](=[#6](\C#N)C#N)-c3cc(ccc-23)S(=O)(=O)[#7]-2-[#6]-[#6]-[#6]-[#6]-2)cc1Cl
:
Substrate
Name:
Caspase-3 Substrate
Synonyms:
N-Acetyl-Asp-Glu-Val-Asp-7-amido-4-methylcoumarin
Type:
Fluorogenic Substrate
Mol. Mass.:
953.05
Organism:
Description:
Residue:
9
ACDEVDAMC