Target
Caspase-6
Ligand
BDBM10356
Substrate
Caspase-6 Substrate
Meas. Tech.
Enzyme Inhibition Assay
IC50
8±n/a nM
Citation
 Chu, WRothfuss, JChu, YZhou, DMach, RH Synthesis and in vitro evaluation of sulfonamide isatin Michael acceptors as small molecule inhibitors of caspase-6. J Med Chem 52:2188-91 (2009)  
Target
Name:
Caspase-6
Synonyms:
Apoptotic protease Mch-2 CASP6 Caspase | MCH2
Type:
Enzyme
Mol. Mass.:
33312.62
Organism:
Homo sapiens (Human)
Description:
P55212
Residue:
293
  
Inhibitor
Name:
BDBM10356
Synonyms:
(4S)-4-{[(1S)-1-{[(2S)-1-carboxy-3-oxopropan-2-yl]carbamoyl}-2-methylbutyl]carbamoyl}-4-[(2S)-2-acetamido-3-methylbutanamido]butanoic acid | Ac-VEID-CHO
Type:
Small organic molecule
Emp. Form.:
C22H36N4O9
Mol. Mass.:
500.5426
SMILES:
CCC(C)[C@H](NC(=O)[C@H](CCC(O)=O)NC(=O)[C@@H](NC(C)=O)C(C)C)C(=O)N[C@@H](CC(O)=O)C=O
:
Substrate
Name:
Caspase-6 Substrate
Synonyms:
N-Acetyl-Val-Glu-Ile-Asp-7-amido-4-methylcoumarin
Type:
Fluorogenic Substrate
Mol. Mass.:
952.13
Organism:
Description:
Residue:
9
ACVEIDAMC