Target
Caspase-7
Ligand
BDBM29573
Substrate
Caspase-7 Substrate
Meas. Tech.
Enzyme Inhibition Assay
IC50
1147±n/a nM
Citation
 Chu, WRothfuss, JChu, YZhou, DMach, RH Synthesis and in vitro evaluation of sulfonamide isatin Michael acceptors as small molecule inhibitors of caspase-6. J Med Chem 52:2188-91 (2009)  
Target
Name:
Caspase-7
Synonyms:
Apoptotic protease Mch-3 CASP7 CMH-1 MCH3 | caspase 7, apoptosis-related cysteine peptidase
Type:
Enzyme
Mol. Mass.:
34273.91
Organism:
Homo sapiens (Human)
Description:
P55210
Residue:
303
  
Inhibitor
Name:
BDBM29573
Synonyms:
isatin Michael acceptor (IMA) analogue, 11b
Type:
Small organic molecule
Emp. Form.:
C24H22N4O4S
Mol. Mass.:
462.521
SMILES:
[#6]-[#8]-c1ccc(-[#6]-[#7]-2-[#6](=O)\[#6](=[#6](\C#N)C#N)-c3cc(ccc-23)S(=O)(=O)[#7]-2-[#6]-[#6]-[#6]-[#6]-[#6]-2)cc1
:
Substrate
Name:
Caspase-7 Substrate
Synonyms:
N-Acetyl-Asp-Glu-Val-Asp-7-amido-4-methylcoumarin
Type:
Fluorogenic Substrate
Mol. Mass.:
953.05
Organism:
Description:
Residue:
9
ACDEVDAMC