Target
Caspase-7
Ligand
BDBM29582
Substrate
Caspase-7 Substrate
Meas. Tech.
Enzyme Inhibition Assay
IC50
248±n/a nM
Citation
 Chu, WRothfuss, JChu, YZhou, DMach, RH Synthesis and in vitro evaluation of sulfonamide isatin Michael acceptors as small molecule inhibitors of caspase-6. J Med Chem 52:2188-91 (2009)  
Target
Name:
Caspase-7
Synonyms:
Apoptotic protease Mch-3 CASP7 CMH-1 MCH3 | caspase 7, apoptosis-related cysteine peptidase
Type:
Enzyme
Mol. Mass.:
34273.91
Organism:
Homo sapiens (Human)
Description:
P55210
Residue:
303
  
Inhibitor
Name:
BDBM29582
Synonyms:
isatin Michael acceptor (IMA) analogue, 18a
Type:
Small organic molecule
Emp. Form.:
C21H16N4O3S
Mol. Mass.:
404.442
SMILES:
O=[#6]1-[#7](-[#6]-c2ccccc2)-c2ccc(cc2\[#6]-1=[#6](/C#N)C#N)S(=O)(=O)[#7]-1-[#6]-[#6]-[#6]-1
:
Substrate
Name:
Caspase-7 Substrate
Synonyms:
N-Acetyl-Asp-Glu-Val-Asp-7-amido-4-methylcoumarin
Type:
Fluorogenic Substrate
Mol. Mass.:
953.05
Organism:
Description:
Residue:
9
ACDEVDAMC