Target
Protein polybromo-1 [645-766]
Ligand
BDBM394415
Substrate
Meas. Tech.
Polybromodomain-1 BromoDomain-5 (PB1-BD5) SM TR-FRET Binding Assay
IC50
51.3±n/a nM
Citation
 Albrecht, BKCote, ACrawford, TDuplessis, MGood, ACLeBlanc, YMagnuson, SRNasveschuk, CGRomero, FATang, YTaylor, AM Therapeutic compounds and uses thereof US Patent  US10308614 Publication Date 6/4/2019 
Target
Name:
Protein polybromo-1 [645-766]
Synonyms:
BAF180 Histidine-Flag-PB1-BD5 Bromodomain (aa 645-766) PB1_HUMAN Protein polybromo-1 (aa 645-766) | Q86U86(S645-D766)
Type:
Enzyme Catalytic Domain
Mol. Mass.:
14410.58
Organism:
Homo sapiens (Human)
Description:
Q86U86(S645-D766)
Residue:
122
  
Inhibitor
Name:
BDBM394415
Synonyms:
2-(6-amino-5-(8-benzyl-3,8- | US10308614, Example 16
Type:
Small organic molecule
Emp. Form.:
C23H25N5O
Mol. Mass.:
387.4775
SMILES:
Nc1nnc(cc1N1CC2CCC(C1)N2Cc1ccccc1)-c1ccccc1O
: