Target
Diacylglycerol O-acyltransferase 1
Ligand
BDBM395361
Substrate
Meas. Tech.
Measurement of DGAT1 Inhibitory Activity
IC50
1.50±n/a nM
Citation
 Saruta, KHayashi, NSakurai, OSawamoto, HOoboki, E Aromatic heterocyclic compound US Patent  US10308636 Publication Date 6/4/2019 
Target
Name:
Diacylglycerol O-acyltransferase 1
Synonyms:
ACAT-related gene product 1 Acyl coA-diacylglycerol acyl transferase 1 (DGAT1) DGAT1 Diacylglycerol Acyltransferase (DGAT1) Diacylglycerol O-acyltransferase 1 (DGAT1) | Diglyceride acyltransferase
Type:
Protein
Mol. Mass.:
55297.82
Organism:
Homo sapiens (Human)
Description:
O75907
Residue:
488
  
Inhibitor
Name:
BDBM395361
Synonyms:
US10308636, Example 45-1
Type:
Small organic molecule
Emp. Form.:
C32H42F3N3O4Si
Mol. Mass.:
617.7743
SMILES:
CCOC(=O)c1cccc(OCC2CCN(CC2)c2ccc(cc2)-c2nc(cn2COCC[Si](C)(C)C)C(F)(F)F)c1C
: