Target
Diacylglycerol O-acyltransferase 1
Ligand
BDBM395364
Substrate
Meas. Tech.
Measurement of DGAT1 Inhibitory Activity
IC50
1.20±n/a nM
Citation
 Saruta, KHayashi, NSakurai, OSawamoto, HOoboki, E Aromatic heterocyclic compound US Patent  US10308636 Publication Date 6/4/2019 
Target
Name:
Diacylglycerol O-acyltransferase 1
Synonyms:
ACAT-related gene product 1 Acyl coA-diacylglycerol acyl transferase 1 (DGAT1) DGAT1 Diacylglycerol Acyltransferase (DGAT1) Diacylglycerol O-acyltransferase 1 (DGAT1) | Diglyceride acyltransferase
Type:
Protein
Mol. Mass.:
55297.82
Organism:
Homo sapiens (Human)
Description:
O75907
Residue:
488
  
Inhibitor
Name:
BDBM395364
Synonyms:
US10308636, Example 46-5
Type:
Small organic molecule
Emp. Form.:
C22H21F4N3O
Mol. Mass.:
419.4153
SMILES:
Fc1ccccc1OC[C@H]1CC[C@@H](CC1)c1ccc(cn1)-c1nc(c[nH]1)C(F)(F)F
: