Target
cAMP-specific 3',5'-cyclic phosphodiesterase 4D
Ligand
BDBM30127
Substrate
BDBM10851
Meas. Tech.
PDE4 Enzyme Assay
pH
8±n/a
Temperature
307.15±n/a K
Ki
2.3±n/a nM
Citation
 Cashman, JRVoelker, TZhang, HTO'Donnell, JM Dual inhibitors of phosphodiesterase-4 and serotonin reuptake. J Med Chem 52:1530-9 (2009)  
Target
Name:
cAMP-specific 3',5'-cyclic phosphodiesterase 4D
Synonyms:
3',5'-cyclic phosphodiesterase PDE43 PDE4D_HUMAN | Phosphodiesterase 4D
Type:
Protein
Mol. Mass.:
91092.69
Organism:
Homo sapiens (Human)
Description:
Q08499
Residue:
809
  
Inhibitor
Name:
BDBM30127
Synonyms:
CHEMBL480988 | phthalazinone, 20
Type:
Small organic molecule
Emp. Form.:
C21H27BrN2O3
Mol. Mass.:
435.355
SMILES:
COc1ccc(cc1OC)C1=NN(CCCCCBr)C(=O)C2CC=CCC12
:
Substrate
Name:
BDBM10851
Synonyms:
(4aR,6R,7R,7aS)-6-(6-amino-9H-purin-9-yl)-2,7-dihydroxy-hexahydro-1,3,5,2-furo[3,2-d][1,3,2]dioxaphosphinin-2-one ADENOSINE-3 ,5 -CYCLIC-MONOPHOSPHATE cAMP | cid_23902375
Type:
Small organic molecule
Emp. Form.:
C10H12N5O6P
Mol. Mass.:
329.2059
SMILES:
Nc1ncnc2n(cnc12)[C@@H]1O[C@@H]2COP(O)(=O)O[C@H]2[C@H]1O
: