Target
Ghrelin O-acyltransferase
Ligand
BDBM396230
Substrate
Meas. Tech.
hGOAT Activity in HEK293 Cells after Incubation
IC50
0.099±n/a nM
Citation
 Godbout, CTrieselmann, TVintonyak, V Oxadiazolopyridine derivatives for use as ghrelin O-acyl transferase (GOAT) inhibitors US Patent  US10308667 Publication Date 6/4/2019 
Target
Name:
Ghrelin O-acyltransferase
Synonyms:
GOAT MBOA4_HUMAN Membrane-bound O-acyltransferase domain-containing protein 4 OACT4
Type:
Enzyme
Mol. Mass.:
49733.10
Organism:
Homo sapiens (Human)
Description:
Q96T53
Residue:
435
  
Inhibitor
Name:
BDBM396230
Synonyms:
6-[5-Bromo-6-(3,3-difluoro-propylamino)-pyridin-2-ylmethyl]-5-methyl-[1,2,5]oxadiazolo[3,4-b]pyridin-7-ylamine | US10308667, Example 133
Type:
Small organic molecule
Emp. Form.:
C15H15BrF2N6O
Mol. Mass.:
413.22
SMILES:
Cc1nc2nonc2c(N)c1Cc1ccc(Br)c(NCCC(F)F)n1
: