Target
Ghrelin O-acyltransferase
Ligand
BDBM396234
Substrate
Meas. Tech.
hGOAT Activity in HEK293 Cells after Incubation
IC50
0.054±n/a nM
Citation
 Godbout, CTrieselmann, TVintonyak, V Oxadiazolopyridine derivatives for use as ghrelin O-acyl transferase (GOAT) inhibitors US Patent  US10308667 Publication Date 6/4/2019 
Target
Name:
Ghrelin O-acyltransferase
Synonyms:
GOAT MBOA4_HUMAN Membrane-bound O-acyltransferase domain-containing protein 4 OACT4
Type:
Enzyme
Mol. Mass.:
49733.10
Organism:
Homo sapiens (Human)
Description:
Q96T53
Residue:
435
  
Inhibitor
Name:
BDBM396234
Synonyms:
6-(7-Amino-5-methyl-[1,2,5]oxadiazolo[3,4-b]pyridin-6-ylmethyl)-2-(2-oxa-6-aza-spiro[3.3]hept-6-yl)-nicotinonitrile | US10308667, Example 137
Type:
Small organic molecule
Emp. Form.:
C18H17N7O2
Mol. Mass.:
363.3733
SMILES:
Cc1nc2nonc2c(N)c1Cc1ccc(C#N)c(n1)N1CC2(COC2)C1
: