Target
MAP kinase-activated protein kinase 2 [41-364]
Ligand
BDBM30289
Substrate
Biotinylated GST-LSP1
Meas. Tech.
Dissociation-Enhanced Lanthanide Fluorescent Immunoassay (DELFIA)
pH
7.6±n/a
Temperature
298.15±n/a K
IC50
1400±n/a nM
Citation
 Xiong, ZGao, DACogan, DAGoldberg, DRHao, MHMoss, NPack, EPargellis, CSkow, DTrieselmann, TWerneburg, BWhite, A Synthesis and SAR studies of indole-based MK2 inhibitors. Bioorg Med Chem Lett 18:1994-9 (2008)  
Target
Name:
MAP kinase-activated protein kinase 2 [41-364]
Synonyms:
MAPK-Activated Protein Kinase 2 (MK2) MAPKAP kinase 2 MAPKAPK2
Type:
Serine/threonine-protein kinase
Mol. Mass.:
37477.48
Organism:
Homo sapiens (Human)
Description:
MK2 was activated with p38alpha MAPK and re-purified by GSH affinity chromatography.
Residue:
324
  
Inhibitor
Name:
BDBM30289
Synonyms:
indole-based 6-membered lactam, (S)-4b
Type:
Small organic molecule
Emp. Form.:
C16H15N5O2S
Mol. Mass.:
341.388
SMILES:
NC[C@H]1Cn2c(cc3ccc(cc23)C(=O)Nc2nccs2)C(=O)N1
:
Substrate
Name:
Biotinylated GST-LSP1
Synonyms:
lymphocyte-specific protein 1
Type:
Other Protein Type
Mol. Mass.:
17410.08
Organism:
Description:
The GST-LSP1 179-339 substrate of MK2 was biotinylated with a 70-fold molar excess of PEO-iodoacetyl biotin (Pierce), followed by quenching with excess DTT and purification by Sephadex G-25 gel filtration.
Residue:
161