Target
MAP kinase-activated protein kinase 2 [41-364]
Ligand
BDBM30298
Substrate
Biotinylated GST-LSP1
Meas. Tech.
Dissociation-Enhanced Lanthanide Fluorescent Immunoassay (DELFIA)
IC50
270±n/a nM
Citation
 Xiong, ZGao, DACogan, DAGoldberg, DRHao, MHMoss, NPack, EPargellis, CSkow, DTrieselmann, TWerneburg, BWhite, A Synthesis and SAR studies of indole-based MK2 inhibitors. Bioorg Med Chem Lett 18:1994-9 (2008)  
Target
Name:
MAP kinase-activated protein kinase 2 [41-364]
Synonyms:
MAPK-Activated Protein Kinase 2 (MK2) MAPKAP kinase 2 MAPKAPK2
Type:
Serine/threonine-protein kinase
Mol. Mass.:
37477.48
Organism:
Homo sapiens (Human)
Description:
MK2 was activated with p38alpha MAPK and re-purified by GSH affinity chromatography.
Residue:
324
  
Inhibitor
Name:
BDBM30298
Synonyms:
indole-based 7-membered lactam, 23a
Type:
Small organic molecule
Emp. Form.:
C18H16N4O2
Mol. Mass.:
320.3452
SMILES:
O=C(Nc1cccnc1)c1ccc2cc3C(=O)NCCCn3c2c1
:
Substrate
Name:
Biotinylated GST-LSP1
Synonyms:
lymphocyte-specific protein 1
Type:
Other Protein Type
Mol. Mass.:
17410.08
Organism:
Description:
The GST-LSP1 179-339 substrate of MK2 was biotinylated with a 70-fold molar excess of PEO-iodoacetyl biotin (Pierce), followed by quenching with excess DTT and purification by Sephadex G-25 gel filtration.
Residue:
161