Target
MAP kinase-activated protein kinase 2 [41-364]
Ligand
BDBM30308
Substrate
Biotinylated GST-LSP1
Meas. Tech.
Dissociation-Enhanced Lanthanide Fluorescent Immunoassay (DELFIA)
IC50
1200±n/a nM
Citation
 Xiong, ZGao, DACogan, DAGoldberg, DRHao, MHMoss, NPack, EPargellis, CSkow, DTrieselmann, TWerneburg, BWhite, A Synthesis and SAR studies of indole-based MK2 inhibitors. Bioorg Med Chem Lett 18:1994-9 (2008)  
Target
Name:
MAP kinase-activated protein kinase 2 [41-364]
Synonyms:
MAPK-Activated Protein Kinase 2 (MK2) MAPKAP kinase 2 MAPKAPK2
Type:
Serine/threonine-protein kinase
Mol. Mass.:
37477.48
Organism:
Homo sapiens (Human)
Description:
MK2 was activated with p38alpha MAPK and re-purified by GSH affinity chromatography.
Residue:
324
  
Inhibitor
Name:
BDBM30308
Synonyms:
indole-based 7-membered lactam, 25i
Type:
Small organic molecule
Emp. Form.:
C19H19N5O3S
Mol. Mass.:
397.451
SMILES:
CC(=O)NCC1CNC(=O)c2cc3ccc(cc3n2C1)C(=O)Nc1nccs1
:
Substrate
Name:
Biotinylated GST-LSP1
Synonyms:
lymphocyte-specific protein 1
Type:
Other Protein Type
Mol. Mass.:
17410.08
Organism:
Description:
The GST-LSP1 179-339 substrate of MK2 was biotinylated with a 70-fold molar excess of PEO-iodoacetyl biotin (Pierce), followed by quenching with excess DTT and purification by Sephadex G-25 gel filtration.
Residue:
161