Target
Dimer of Gag-Pol polyprotein [489-587]
Ligand
BDBM597
Substrate
Peptide substrate
Meas. Tech.
Protease Inhibition Assay
pH
6±n/a
Temperature
310.15±n/a K
IC50
820±n/a nM
Citation
 Humber, DCBamford, MJBethell, RCCammack, NCobley, KEvans, DNGray, NMHann, MMOrr, DCSaunders, J A series of penicillin derived C2-symmetric inhibitors of HIV-1 proteinase: synthesis, mode of interaction, and structure-activity relationships. J Med Chem 36:3120-8 (1993)  
Target
Name:
Dimer of Gag-Pol polyprotein [489-587]
Synonyms:
HIV-1 Protease
Type:
Protein Complex
Mol. Mass.:
Description:
Components:
This complex has 2 components.
Component 1
Name:
Gag-Pol polyprotein [489-587]
Synonyms:
HIV protease HIV-1 Protease chain A POL_HV1N5 | gag-pol
Type:
Enzyme Subunit
Mol. Mass.:
10822.21
Organism:
Human immunodeficiency virus type 1
Description:
P12497[489-587]
Residue:
99
  
Component 2
Name:
Gag-Pol polyprotein [489-587]
Synonyms:
HIV protease HIV-1 Protease chain A POL_HV1N5 | gag-pol
Type:
Enzyme Subunit
Mol. Mass.:
10822.21
Organism:
Human immunodeficiency virus type 1
Description:
P12497[489-587]
Residue:
99
  
Inhibitor
Name:
BDBM597
Synonyms:
(2R,4S)-2-[(R)-[benzyl(methyl)carbamoyl](1-phenylacetamido)methyl]-N-(2-{[(2R,4S)-2-[(R)-[benzyl(methyl)carbamoyl](1-phenylacetamido)methyl]-5,5-dimethyl-1,3-thiazolidin-4-yl]formamido}ethyl)-5,5-dimethyl-1,3-thiazolidine-4-carboxamide penicillin deriv. 10
Type:
Small organic molecule
Emp. Form.:
C50H62N8O6S2
Mol. Mass.:
935.207
SMILES:
[H][C@]1(N[C@@H](C(=O)NCCNC(=O)[C@@H]2N[C@]([H])(SC2(C)C)[C@H](NC(=O)Cc2ccccc2)C(=O)N(C)Cc2ccccc2)C(C)(C)S1)[C@H](NC(=O)Cc1ccccc1)C(=O)N(C)Cc1ccccc1
:
Substrate
Name:
Peptide substrate
Synonyms:
Type:
Peptide
Mol. Mass.:
1467.64
Organism:
Description:
Residue:
13
KQGTVSFNFPQIT