Target
Genome polyprotein
Ligand
BDBM30429
Substrate
biotinylated oligo (rG13)/poly rC
Meas. Tech.
NS5B Polymerase Inhibition Assay (IC50) and HCV Replicon Assay (EC50)
pH
7.5±n/a
Temperature
301.15±n/a K
IC50
92±n/a nM
EC50
710±n/a nM
Citation
 Zhou, YWebber, SEMurphy, DELi, LSDragovich, PSTran, CVSun, ZRuebsam, FShah, AMTsan, MShowalter, REPatel, RLi, BZhao, QHan, QHermann, TKissinger, CRLebrun, LSergeeva, MVKirkovsky, L Novel HCV NS5B polymerase inhibitors derived from 4-(1',1'-dioxo-1',4'-dihydro-1'lambda6-benzo[1',2',4']thiadiazin-3'-yl)-5-hydroxy-2H-pyridazin-3-ones. Part 1: exploration of 7'-substitution of benzothiadiazine. Bioorg Med Chem Lett 18:1413-8 (2008)  
Target
Name:
Genome polyprotein
Synonyms:
Genome polyprotein POLG_HCVBK | RNA-directed RNA polymerase (NS5B)
Type:
Protein
Mol. Mass.:
327252.46
Organism:
Hepatitis C virus genotype 1b (isolate BK) (HCV)
Description:
P26663
Residue:
3010
  
Inhibitor
Name:
BDBM30429
Synonyms:
pyridazinone derivative, 8h
Type:
Small organic molecule
Emp. Form.:
C23H25N5O6S2
Mol. Mass.:
531.605
SMILES:
CNC(=O)COc1ccc2N=C(NS(=O)(=O)c2c1)c1c(O)c(nn(CCC(C)C)c1=O)-c1cccs1
:
Substrate
Name:
biotinylated oligo (rG13)/poly rC
Synonyms:
Type:
RNA
Mol. Mass.:
358.43
Organism:
Description:
[alpha-33P]GTP/GTP as co-substrate.
Residue:
3
NA