Target
Genome polyprotein
Ligand
BDBM30446
Substrate
biotinylated oligo (rG13)/poly rC
Meas. Tech.
NS5B Polymerase Inhibition Assay (IC50)
pH
7.5±n/a
Temperature
301.15±n/a K
IC50
290±n/a nM
Citation
 Zhou, YWebber, SEMurphy, DELi, LSDragovich, PSTran, CVSun, ZRuebsam, FShah, AMTsan, MShowalter, REPatel, RLi, BZhao, QHan, QHermann, TKissinger, CRLebrun, LSergeeva, MVKirkovsky, L Novel HCV NS5B polymerase inhibitors derived from 4-(1',1'-dioxo-1',4'-dihydro-1'lambda6-benzo[1',2',4']thiadiazin-3'-yl)-5-hydroxy-2H-pyridazin-3-ones. Part 1: exploration of 7'-substitution of benzothiadiazine. Bioorg Med Chem Lett 18:1413-8 (2008)  
Target
Name:
Genome polyprotein
Synonyms:
Genome polyprotein POLG_HCVBK | RNA-directed RNA polymerase (NS5B)
Type:
Protein
Mol. Mass.:
327252.46
Organism:
Hepatitis C virus genotype 1b (isolate BK) (HCV)
Description:
P26663
Residue:
3010
  
Inhibitor
Name:
BDBM30446
Synonyms:
pyridazinone derivative, 8y
Type:
Small organic molecule
Emp. Form.:
C22H21N7O4S2
Mol. Mass.:
511.577
SMILES:
CC(C)CCn1nc(-c2cccs2)c(O)c(C2=Nc3ccc(cc3S(=O)(=O)N2)-c2c[nH]nn2)c1=O
:
Substrate
Name:
biotinylated oligo (rG13)/poly rC
Synonyms:
Type:
RNA
Mol. Mass.:
358.43
Organism:
Description:
[alpha-33P]GTP/GTP as co-substrate.
Residue:
3
NA