Target
5-hydroxytryptamine receptor 1A
Ligand
BDBM30762
Substrate
Not Available
Meas. Tech.
Dose Response Assay for Agonists of 5-Hydroxytryptamine (Serotonin) Receptor Subtype 1A (5HT1A)
pH
7.4±n/a
Temperature
296.15±n/a K
EC50
11000±n/a nM
Citation
 PubChem, PC Dose Response Assay for 5-Hydroxytryptamine (Serotonin) Receptor Subtype 1a (5HT1a) Agonists PubChem Bioassay (2007)[AID] 
Target
Name:
5-hydroxytryptamine receptor 1A
Synonyms:
5-HT-1A 5-hydroxytryptamine receptor 1A (5-HT-1A) ADRB2RL1 Dopamine D2 receptor and serotonin 1a receptor HTR1A | Serotonin receptor 1A
Type:
Mol. Mass.:
46122.49
Organism:
Homo sapiens (Human)
Description:
Residue:
422
  
Inhibitor
Name:
BDBM30762
Synonyms:
2-amino-N-butan-2-yl-1-(2-oxolanylmethyl)-3-pyrrolo[3,2-b]quinoxalinecarboxamide 2-amino-N-sec-butyl-1-(tetrahydrofurfuryl)pyrrolo[3,2-b]quinoxaline-3-carboxamide MLS000040979 cid_662288
Type:
Small organic molecule
Emp. Form.:
C20H25N5O2
Mol. Mass.:
367.4448
SMILES:
CCC(C)NC(=O)c1c(N)n(CC2CCCO2)c2nc3ccccc3nc12
:
Substrate
Name:
Not Available
Synonyms:
Type:
Mol. Mass.:
358.43
Organism:
Description:
Residue:
3
NA