Target
5-hydroxytryptamine receptor 1A
Ligand
BDBM30970
Substrate
Not Available
Meas. Tech.
Dose Response Assay for Agonists of 5-Hydroxytryptamine (Serotonin) Receptor Subtype 1A (5HT1A)
pH
7.4±n/a
Temperature
296.15±n/a K
EC50
99000±n/a nM
Citation
 PubChem, PC Dose Response Assay for 5-Hydroxytryptamine (Serotonin) Receptor Subtype 1a (5HT1a) Agonists PubChem Bioassay (2007)[AID] 
Target
Name:
5-hydroxytryptamine receptor 1A
Synonyms:
5-HT-1A 5-hydroxytryptamine receptor 1A (5-HT-1A) ADRB2RL1 Dopamine D2 receptor and serotonin 1a receptor HTR1A | Serotonin receptor 1A
Type:
Mol. Mass.:
46122.49
Organism:
Homo sapiens (Human)
Description:
Residue:
422
  
Inhibitor
Name:
BDBM30970
Synonyms:
2-ethylsulfanylethyl 4-(1,3-benzodioxol-5-yl)-6-methyl-2-oxidanylidene-3,4-dihydro-1H-pyrimidine-5-carboxylate 4-(1,3-benzodioxol-5-yl)-2-keto-6-methyl-3,4-dihydro-1H-pyrimidine-5-carboxylic acid 2-(ethylthio)ethyl ester MLS000103986 cid_3103180
Type:
Small organic molecule
Emp. Form.:
C17H20N2O5S
Mol. Mass.:
364.416
SMILES:
CCSCCOC(=O)C1C(NC(=O)N=C1C)c1ccc2OCOc2c1
:
Substrate
Name:
Not Available
Synonyms:
Type:
Mol. Mass.:
358.43
Organism:
Description:
Residue:
3
NA