Target
Aurora kinase A
Ligand
BDBM31539
Substrate
CHOCKtide
Meas. Tech.
Kinase SPA Assay
Temperature
298.15±n/a K
IC50
53±n/a nM
Comments
extracted
Citation
 Brasca, MGAmboldi, NBallinari, DCameron, ACasale, ECervi, GColombo, MColotta, FCroci, VD'Alessio, RFiorentini, FIsacchi, AMercurio, CMoretti, WPanzeri, APastori, WPevarello, PQuartieri, FRoletto, FTraquandi, GVianello, PVulpetti, ACiomei, M Identification of N,1,4,4-Tetramethyl-8-{[4-(4-methylpiperazin-1-yl)phenyl]amino}-4,5-dihydro-1H-pyrazolo[4,3-h]quinazoline-3-carboxamide (PHA-848125), a Potent, Orally Available Cyclin Dependent Kinase Inhibitor. J Med Chem 52:5152-63 (2009)  
Target
Name:
Aurora kinase A
Synonyms:
AIK ARK-1 AURA AURKA_HUMAN Aurora 2 Aurora kinase A (AURKA) Aurora kinase A (Aurora-2) Aurora/IPL1-related kinase 1 Breast tumor-amplified kinase IAK1 STK15 GN Serine/threonine kinase 15 Serine/threonine-protein kinase 6 Serine/threonine-protein kinase aurora-A aurora-2 | hARK1
Type:
Serine/threonine-protein kinase
Mol. Mass.:
45830.98
Organism:
Homo sapiens (Human)
Description:
O14965
Residue:
403
  
Inhibitor
Name:
BDBM31539
Synonyms:
pyrazolo[4,3-h]quinazoline-3-carboxamide, 22
Type:
Small organic molecule
Emp. Form.:
C22H26N8O
Mol. Mass.:
418.4948
SMILES:
CN1CCN(CC1)c1ccc(Nc2ncc3CCc4c(nn(C)c4-c3n2)C(N)=O)cc1
:
Substrate
Name:
CHOCKtide
Synonyms:
Type:
Peptide
Mol. Mass.:
889.06
Organism:
Description:
Residue:
7
LRRWSLG