Target
Thymidylate synthase
Ligand
BDBM31784
Substrate
BDBM18754
Meas. Tech.
Thymidylate Synthase (TS) Assay
pH
7.4±n/a
Temperature
303.15±n/a K
IC50
2300±n/a nM
Citation
 Gangjee, ALi, WKisliuk, RLCody, VPace, JPiraino, JMakin, J Design, synthesis, and X-ray crystal structure of classical and nonclassical 2-amino-4-oxo-5-substituted-6-ethylthieno[2,3-d]pyrimidines as dual thymidylate synthase and dihydrofolate reductase inhibitors and as potential antitumor agents. J Med Chem 52:4892-902 (2009)  
Target
Name:
Thymidylate synthase
Synonyms:
TS TYMS Thymidylate synthase (TS) | Thymidylate synthase/GAR transformylase/AICAR transformylase
Type:
Enzyme
Mol. Mass.:
35718.07
Organism:
Homo sapiens (Human)
Description:
Residue:
313
  
Inhibitor
Name:
BDBM31784
Synonyms:
thieno[2,3-d]pyrimidine deriv., 2g
Type:
Small organic molecule
Emp. Form.:
C18H15N3OS2
Mol. Mass.:
353.461
SMILES:
CCc1sc2nc(N)[nH]c(=O)c2c1Sc1ccc2ccccc2c1
:
Substrate
Name:
BDBM18754
Synonyms:
(2S)-2-[(4-{11-amino-13-oxo-2,4,8,10,12-pentaazatricyclo[7.4.0.0^{2,6}]trideca-1(9),11-dien-4-yl}phenyl)formamido]pentanedioate 5,10-Methylenetetrahydrofolate
Type:
Small organic molecule
Emp. Form.:
C20H21N7O6
Mol. Mass.:
455.4251
SMILES:
Nc1nc2NCC3CN(CN3c2c(=O)[nH]1)c1ccc(cc1)C(=O)N[C@@H](CCC([O-])=O)C([O-])=O
: