Target
Mast/stem cell growth factor receptor Kit [D816V]
Ligand
BDBM397914
Substrate
Meas. Tech.
Biochemical Activity Assay
IC50
<1±n/a nM
Citation
 DiPietro, LVHodous, BLKim, JLMiduturu, CVWenglowsky, SMWilson, DZhang, Y Compositions useful for treating disorders related to kit US Patent  US9994552 Publication Date 6/12/2018 
Target
Name:
Mast/stem cell growth factor receptor Kit [D816V]
Synonyms:
KIT Mast/stem cell growth factor receptor Kit (D816V) SCFR | Tyrosine-protein kinase Kit (Kit)(D816V)
Type:
Protein
Mol. Mass.:
109854.42
Organism:
Homo sapiens (Human)
Description:
Human Kit D816V mutant
Residue:
976
  
Inhibitor
Name:
BDBM397914
Synonyms:
US9994552, Compound 125
Type:
Small organic molecule
Emp. Form.:
C31H38N8O2
Mol. Mass.:
554.6858
SMILES:
COc1cc2ncnc(N3CCN(CC3)c3ncc(Cc4ccccc4)c(N)n3)c2cc1OCC1CCN(C)CC1
: