Target
Heat shock protein HSP 90-alpha
Ligand
BDBM32099
Substrate
cy3B-GM
Meas. Tech.
Tumor Hsp90 Inhibitors Dose Response Confirmation
pH
7.4±n/a
Temperature
296.15±n/a K
IC50
23359.5±n/a nM
Citation
 PubChem, PC Tumor Hsp90 Inhibitors Dose Response Confirmation PubChem Bioassay (2007)[AID] 
Target
Name:
Heat shock protein HSP 90-alpha
Synonyms:
HS90A_HUMAN HSP86 HSP90AA1 HSPCA Heat shock 86 kDa Heat shock protein HSP 90-alpha (HSP90) LAP-2 Lipopolysaccharide-associated protein 2 heat shock protein 90kDa alpha (cytosolic), class A member 1 isoform 2
Type:
Molecular Chaperone
Mol. Mass.:
84623.45
Organism:
Homo sapiens (Human)
Description:
P07900
Residue:
732
  
Inhibitor
Name:
BDBM32099
Synonyms:
MLS000044274 N-[5-chloro-2-(trifluoromethyl)-1,3-benzodioxol-2-yl]-1,4-dioxa-8-azaspiro[4.5]decane-8-carboxamide cid_3243924
Type:
Small organic molecule
Emp. Form.:
C16H16ClF3N2O5
Mol. Mass.:
408.757
SMILES:
FC(F)(F)C1(NC(=O)N2CCC3(CC2)OCCO3)Oc2ccc(Cl)cc2O1
:
Substrate
Name:
cy3B-GM
Synonyms:
fluorescently (Cy3B) labeled geldanamycin
Type:
fluorescent probe
Mol. Mass.:
358.43
Organism:
Description:
Residue:
3
NA