Target
Heat shock protein HSP 90-alpha
Ligand
BDBM32203
Substrate
cy3B-GM
Meas. Tech.
Tumor Hsp90 Inhibitors Dose Response Confirmation
pH
7.4±n/a
Temperature
296.15±n/a K
IC50
50000±n/a nM
Citation
 PubChem, PC Tumor Hsp90 Inhibitors Dose Response Confirmation PubChem Bioassay (2007)[AID] 
Target
Name:
Heat shock protein HSP 90-alpha
Synonyms:
HS90A_HUMAN HSP86 HSP90AA1 HSPCA Heat shock 86 kDa Heat shock protein HSP 90-alpha (HSP90) LAP-2 Lipopolysaccharide-associated protein 2 heat shock protein 90kDa alpha (cytosolic), class A member 1 isoform 2
Type:
Molecular Chaperone
Mol. Mass.:
84623.45
Organism:
Homo sapiens (Human)
Description:
P07900
Residue:
732
  
Inhibitor
Name:
BDBM32203
Synonyms:
8-quinolinol US10005735, Table 1.7 cid_1923 quinolin-8-ol
Type:
Small organic molecule
Emp. Form.:
C9H7NO
Mol. Mass.:
145.158
SMILES:
Oc1cccc2cccnc12
:
Substrate
Name:
cy3B-GM
Synonyms:
fluorescently (Cy3B) labeled geldanamycin
Type:
fluorescent probe
Mol. Mass.:
358.43
Organism:
Description:
Residue:
3
NA