Target
Collagenase 3
Ligand
BDBM32396
Substrate
5-FAM/QXL 520 Peptide Substrate
Meas. Tech.
Fluorescence Resonance Energy Transfer (FRET) Assay
pH
7.5±n/a
Temperature
310.15±n/a K
IC50
620±n/a nM
Citation
 Heim-Riether, ATaylor, SJLiang, SGao, DAXiong, ZMichael August, ECollins, BKFarmer, BTHaverty, KHill-Drzewi, MJunker, HDMariana Margarit, SMoss, NNeumann, TProudfoot, JRKeenan, LSSekul, RZhang, QLi, JFarrow, NA Improving potency and selectivity of a new class of non-Zn-chelating MMP-13 inhibitors. Bioorg Med Chem Lett 19:5321-4 (2009)  
Target
Name:
Collagenase 3
Synonyms:
MMP-13 MMP13_HUMAN Matrix metalloproteinase-13 (MMP-13) | Matrix metalloproteinase-13 (MMP13)
Type:
Enzyme
Mol. Mass.:
53808.06
Organism:
Homo sapiens (Human)
Description:
P45452
Residue:
471
  
Inhibitor
Name:
BDBM32396
Synonyms:
furan-2-carboxamide deriv., 2
Type:
Small organic molecule
Emp. Form.:
C29H29N3O5
Mol. Mass.:
499.5577
SMILES:
CNC(=O)[C@@H](NC(=O)c1ccc(o1)-c1ccc(NC(=O)c2cc3ccccc3o2)cc1)C1CCCCC1
:
Substrate
Name:
5-FAM/QXL 520 Peptide Substrate
Synonyms:
Type:
FRET Peptide
Mol. Mass.:
1848.68
Organism:
Description:
EnzoLyte520 Generic MMP Assay Kit (AnaSpec Inc.).
Residue:
15
QLPLAYWARKFAMNH