Target
Baculoviral IAP repeat-containing protein 3
Ligand
BDBM32576
Substrate
BDBM17342
Meas. Tech.
Fluorescence Polarization Affinity Measurements
pH
7.2±n/a
Temperature
295.15±n/a K
Ki
33±n/a nM
Citation
 Ndubaku, CVarfolomeev, EWang, LZobel, KLau, KElliott, LOMaurer, BFedorova, AVDynek, JNKoehler, MHymowitz, SGTsui, VDeshayes, KFairbrother, WJFlygare, JAVucic, D Antagonism of c-IAP and XIAP proteins is required for efficient induction of cell death by small-molecule IAP antagonists. ACS Chem Biol 4:557-66 (2009)  
Target
Name:
Baculoviral IAP repeat-containing protein 3
Synonyms:
API2 BIRC3_HUMAN Baculoviral IAP repeat-containing protein 3 (IAP1 BIR3) MIHC XIAP-BIR3 | cIAP1/cIAP2
Type:
Protein
Mol. Mass.:
68365.75
Organism:
Homo sapiens (Human)
Description:
Q13489
Residue:
604
  
Inhibitor
Name:
BDBM32576
Synonyms:
PS-1
Type:
Small organic molecule
Emp. Form.:
C27H32ClN5O3S
Mol. Mass.:
542.093
SMILES:
CN[C@@H](C)C(=O)N[C@@H](C1CCOCC1)C(=O)N1CCC[C@H]1c1nc2c(nccc2s1)-c1ccccc1Cl
:
Substrate
Name:
BDBM17342
Synonyms:
5-carboxyflourescein(5-FAM)-conjugated AVPFFAKK | AVP-diPhe-FAM
Type:
Fluorescent dye-conjugated peptide
Emp. Form.:
Mol. Mass.:
SMILES:
: