Target
Bcl-2-related protein A1
Ligand
BDBM33062
Substrate
FITC-conjugated-Bim BH3 Peptide
Meas. Tech.
Multiplexed dose response screen for small molecule regulators of Bcl-2 family protein interactions, specifically Bim-Bfl-1.
pH
7.4±n/a
Temperature
277.15±n/a K
EC50
15380±n/a nM
Citation
 PubChem, PC Multiplexed dose response screen for small molecule regulators of Bcl-2 family protein interactions, specifically Bim-Bfl-1. PubChem Bioassay (2008)[AID] 
Target
Name:
Bcl-2-related protein A1
Synonyms:
B2LA1_HUMAN BCL2L5 Bcl-2-like protein 5 HBPA1 Protein BFL-1 | Protein GRS
Type:
Apoptosis regulator protein
Mol. Mass.:
20130.01
Organism:
Homo sapiens (Human)
Description:
Residue:
175
  
Inhibitor
Name:
BDBM33062
Synonyms:
3-chloranyl-4-[(1,5-dimethyl-3-oxidanylidene-2-phenyl-pyrazol-4-yl)amino]-1-phenyl-pyrrole-2,5-dione 3-chloro-4-[(1,5-dimethyl-3-oxo-2-phenylpyrazol-4-yl)amino]-1-phenylpyrrole-2,5-dione MLS000110254 cid_1177165
Type:
Small organic molecule
Emp. Form.:
C21H17ClN4O3
Mol. Mass.:
408.838
SMILES:
Cc1c(N=C2C(Cl)C(=O)N(C2=O)c2ccccc2)c(=O)n(-c2ccccc2)n1C
:
Substrate
Name:
FITC-conjugated-Bim BH3 Peptide
Synonyms:
FITC-Ahx-DMRPEIWIAQELRRIGDEFNAYYAR-OH
Type:
FITC-labeled Peptide
Mol. Mass.:
3112.46
Organism:
Description:
Residue:
25