Target
Vascular endothelial growth factor A
Ligand
BDBM107704
Substrate
Meas. Tech.
VEGF ELISA Assay
EC50
7600±n/a nM
Citation
 Kawamoto, RMWu, SEvdokimov, AGGreis, KDBoyer, ASWarshakoon, NC Prolyl hydroxylase inhibitors and methods of use US Patent  USRE47437 Publication Date 6/18/2019 
Target
Name:
Vascular endothelial growth factor A
Synonyms:
VEGF VEGFA VPF Vascular endothelial growth factor A (VEGF) Vascular permeability factor
Type:
Protein
Mol. Mass.:
27063.81
Organism:
Homo sapiens (Human)
Description:
P15692
Residue:
395
  
Inhibitor
Name:
BDBM107704
Synonyms:
US11426393, Compound Table XV.11 US8598210, Table XV, 10 US8722895, 10: {[5-(3-Chlorophenyl)-3-hydroxypyridine-2- carbonyl]amino}-acetic acid trifluoroacetic acid salt US9598370, Example 00136 | USRE47437, Example {[5-(3-Chlorophenyl)-3-hydroxypyridine-2-carbonyl]amino}-acetic acid
Type:
Small organic molecule
Emp. Form.:
C14H11ClN2O4
Mol. Mass.:
306.701
SMILES:
OC(=O)CNC(=O)c1ncc(cc1O)-c1cccc(Cl)c1
: