Target
Reverse transcriptase/RNaseH
Ligand
BDBM33411
Substrate
RNA/DNA hybrid
Meas. Tech.
Fluorescence-Based RNase H Assay
pH
8±n/a
Temperature
293.15±n/a K
IC50
660±n/a nM
Comments
IC50 is the mean of 0.60 and 0.72 uM.
Citation
 Kirschberg, TABalakrishnan, MSquires, NHBarnes, TBrendza, KMChen, XEisenberg, EJJin, WKutty, NLeavitt, SLiclican, ALiu, QLiu, XMak, JPerry, JKWang, MWatkins, WJLansdon, EB RNase H active site inhibitors of human immunodeficiency virus type 1 reverse transcriptase: design, biochemical activity, and structural information. J Med Chem 52:5781-4 (2009)  
Target
Name:
Reverse transcriptase/RNaseH
Synonyms:
HIV-1 Reverse Transcriptase RNase H Reverse transcriptase/RNaseH
Type:
PROTEIN
Mol. Mass.:
65229.15
Organism:
Human immunodeficiency virus 1
Description:
ChEMBL_1473730
Residue:
566
  
Inhibitor
Name:
BDBM33411
Synonyms:
β-Thujaplicinol | hydroxytropolone, 3
Type:
Small organic molecule
Emp. Form.:
C10H12O3
Mol. Mass.:
180.2005
SMILES:
CC(C)c1ccc(O)c(=O)c(O)c1
:
Substrate
Name:
RNA/DNA hybrid
Synonyms:
Type:
fluorescein-labeled RNA annealed to DNA
Mol. Mass.:
2134.40
Organism:
Description:
It is a 18-nucleotide 3-fluorescein-labeled RNA annealed to a complementary 18-nucleotide 5-Dabcyl-modified DNA.
Residue:
23