Target
Prothrombin
Ligand
BDBM33743
Substrate
Boc-Val-Pro-Arg-AMC
Meas. Tech.
Thrombin 1536 HTS Dose Response Confirmation
pH
7.5±n/a
Temperature
296.15±n/a K
IC50
>50000±n/a nM
Citation
 PubChem, PC Thrombin 1536 HTS Dose Response Confirmation PubChem Bioassay (2008)[AID] 
Target
Name:
Prothrombin
Synonyms:
Activation peptide fragment 1 Coagulation factor II Prothrombin precursor Thrombin heavy chain | Thrombin light chain
Type:
Protein
Mol. Mass.:
70029.57
Organism:
Homo sapiens (Human)
Description:
P00734
Residue:
622
  
Inhibitor
Name:
BDBM33743
Synonyms:
(3Z)-3-[3-[2-(5,6-dihydrobenzo[b][1]benzazepin-11-yl)-2-oxidanylidene-ethyl]sulfanyl-4-methyl-1H-1,2,4-triazol-5-ylidene]naphthalen-2-one (3Z)-3-[3-[[2-(5,6-dihydrobenzo[b][1]benzazepin-11-yl)-2-keto-ethyl]thio]-4-methyl-1H-1,2,4-triazol-5-ylidene]naphthalen-2-one 1-(10,11-Dihydro-dibenzo[b,f]azepin-5-yl)-2-[5-(3-hydroxy-naphthalen-2-yl)-4-methyl-4H-[1,2,4]triazol-3-ylsulfanyl]-ethanone SMR000170931 | cid_5770601
Type:
Small organic molecule
Emp. Form.:
C29H24N4O2S
Mol. Mass.:
492.591
SMILES:
Cn1c(SCC(=O)N2c3ccccc3CCc3ccccc23)nnc1-c1cc2ccccc2cc1O
:
Substrate
Name:
Boc-Val-Pro-Arg-AMC
Synonyms:
Type:
fluorogenic substrate
Mol. Mass.:
358.43
Organism:
Description:
Residue:
3
NA